{"text_format":"3","workbook":"xlsx","n_sheets":3,"sheets":["Virselis","Kartis M","Kartis V"],"not_rendered":{"images":1,"external_links":3,"defined_names":5},"read":"whole","date_system":"1900"}

{"sheet":"Virselis","index":0,"n_rows":31,"n_cols":11,"rows_kept":31}
[]
[]
[]
[]
[]
[null,null,"LIETUVOS LAF TAURĖS ŠUOLIŲ SU KARTIMI VARŽYBOS "]
{"$rows_empty":13}
[null,null,"2025 m. gruodžio 12 d."]
[]
[]
[null,null,"Šiauliai"]
[]
[]
[]
[{"$nulls":3},"Varžybų vyr. teisėja",{"$nulls":6},"Urtė Baikštytė"]
[]
[{"$nulls":3},"Varžybų sekretorius",{"$nulls":6},"Evaldas Reinotas"]
[]
[{"$nulls":3},"Varžybų techninis delegatas",{"$nulls":6},"Deimantas Jusys"]

{"sheet":"Kartis M","index":1,"n_rows":23,"n_cols":36,"rows_kept":23,"merged":[[5,4,5,6],[5,7,5,9],[5,10,5,12],[5,13,5,15],[5,16,5,18],[5,19,5,21],[5,22,5,24],[5,25,5,27],[5,28,5,30],[5,31,5,33],[6,4,6,6],[6,7,6,9],[6,10,6,12],[6,13,6,15],[6,16,6,18],[6,19,6,21],[6,22,6,24],[6,25,6,27],[6,28,6,30],[6,31,6,33],[7,0,8,0],[7,34,8,34],[9,0,10,0],[9,34,10,34],[11,0,12,0],[11,34,12,34],[13,0,14,0],[13,34,14,34],[15,0,16,0],[15,34,16,34],[17,0,18,0],[17,34,18,34],[19,0,20,0],[19,34,20,34],[21,0,22,0],[21,34,22,34]]}
["LIETUVOS LAF TAURĖS ŠUOLIŲ SU KARTIMI VARŽYBOS "]
["Šiauliai, 2025 m. gruodžio 12 d."]
[]
[null,null,"Moterys"]
[]
[null,"Vardas","Pavardė","Komanda","2,10",null,null,"2,30",null,null,"2,50",null,null,"2,70",null,null,"2,90",null,null,"3,10",null,null,"3,30",null,null,"3,50",null,null,"3,60",null,null,"3,70"]
["Vieta","Gimimo data","Treneris","Sporto mokykla","3,80",null,null,"4,00",null,null,"4,10",null,null,"4,20",null,null,"4,32",null,null,"4,36",{"$nulls":14},"Rezultatas","Kv. l"]
[1,"Rugilė","Miklyčiūtė","Kaunas",{"$nulls":30},4.32,"TSM"]
[null,"2005-05-04","R.Sadzevičienė","Startas",{"$nulls":3},"O",null,null,"X","O",null,"O",null,null,"O",null,null,"X","X","X"]
[2,"Elzė","Kudulytė","Kaunas",{"$nulls":24},"X","O",null,"X","X","O",{"v":3.7,"d":"3.70"},{"$f":"IF(ISBLANK(AI10),\"\",IF(AI10>=3.48,\"KSM\",IF(AI10>=3.1,\"I A\",IF(AI10>=2.7,\"II A\",IF(AI10>=2.4,\"III A\",IF(AI10>=2.15,\"I JA\",IF(AI10>=1.95,\"II JA\",IF(AI10>=1.8,\"III JA\"))))))))","v":"KSM"}]
[null,"2004-12-15","R.Sadzevičienė","Startas","X","X","X"]
[3,"Kamilė","Petrauskaitė","Kaunas",{"$nulls":15},"X","X","O","O",null,null,"X","X","X",{"$nulls":6},{"v":3.3,"d":"3.30"},{"$f":"IF(ISBLANK(AI12),\"\",IF(AI12>=3.48,\"KSM\",IF(AI12>=3.1,\"I A\",IF(AI12>=2.7,\"II A\",IF(AI12>=2.4,\"III A\",IF(AI12>=2.15,\"I JA\",IF(AI12>=1.95,\"II JA\",IF(AI12>=1.8,\"III JA\"))))))))","v":"I A"}]
[null,"2006-09-28","R.Sadzevičienė","Startas"]
[4,"Agnė","Kryževičiūtė","Šiauliai",{"$nulls":12},"X","O",null,"X","X","X",{"$nulls":12},{"v":2.9,"d":"2.90"},{"$f":"IF(ISBLANK(AI14),\"\",IF(AI14>=3.48,\"KSM\",IF(AI14>=3.1,\"I A\",IF(AI14>=2.7,\"II A\",IF(AI14>=2.4,\"III A\",IF(AI14>=2.15,\"I JA\",IF(AI14>=1.95,\"II JA\",IF(AI14>=1.8,\"III JA\"))))))))","v":"II A"}]
[null,"2009-12-10","V. Žiedienė, J. Spudis","ŠLASC"]
[5,"Augustė","Iršaitė","Kaunas",{"$nulls":3},"O",null,null,"O",null,null,"O",null,null,"X","X","X",{"$nulls":15},{"v":2.7,"d":"2.70"},{"$f":"IF(ISBLANK(AI16),\"\",IF(AI16>=3.48,\"KSM\",IF(AI16>=3.1,\"I A\",IF(AI16>=2.7,\"II A\",IF(AI16>=2.4,\"III A\",IF(AI16>=2.15,\"I JA\",IF(AI16>=1.95,\"II JA\",IF(AI16>=1.8,\"III JA\"))))))))","v":"II A"}]
[null,"2009-09-21","R.Sadzevičienė","Startas"]
[6,"Adriana","Norvaišaitė","Kaunas","X","O",null,"X","O",null,"X","X","X",{"$nulls":21},{"v":2.3,"d":"2.30"},{"$f":"IF(ISBLANK(AI18),\"\",IF(AI18>=3.48,\"KSM\",IF(AI18>=3.1,\"I A\",IF(AI18>=2.7,\"II A\",IF(AI18>=2.4,\"III A\",IF(AI18>=2.15,\"I JA\",IF(AI18>=1.95,\"II JA\",IF(AI18>=1.8,\"III JA\"))))))))","v":"I JA"}]
[null,"2008-03-21","I.Jakubaitytė","Startas"]
[null,"Ugnė","Vasiliauskaitė","Šiauliai",{"$nulls":30},"DNS"]
[null,"2008-01-09","V. Žiedienė, J. Spudis","ŠLASC"]
[null,"Jekaterina","Kucajeva","Klaipėda",{"$nulls":30},"DNS"]
[null,"2010-05-07","N. Krakiene","BĮ Klaipėdos LAM"]

{"sheet":"Kartis V","index":2,"n_rows":11,"n_cols":36,"rows_kept":11,"merged":[[5,4,5,6],[5,7,5,9],[5,10,5,12],[5,13,5,15],[5,16,5,18],[5,19,5,21],[5,22,5,24],[5,25,5,27],[5,28,5,30],[5,31,5,33],[6,4,6,6],[6,7,6,9],[6,10,6,12],[6,13,6,15],[6,16,6,18],[6,19,6,21],[6,22,6,24],[6,25,6,27],[6,28,6,30],[6,31,6,33],[7,0,8,0],[7,34,8,34],[9,0,10,0],[9,34,10,34]]}
["LIETUVOS LAF TAURĖS ŠUOLIŲ SU KARTIMI VARŽYBOS "]
["Šiauliai, 2025 m. gruodžio 12 d."]
[]
[null,null,"Vyrai"]
[]
[null,"Vardas","Pavardė","Komanda","2,80",null,null,"3,00",null,null,"3,20",null,null,"4,80",null,null,"5,00"]
["Vieta","Gimimo data","Treneris","Sporto mokykla",{"$nulls":30},"Rezultatas","Kv. l"]
[1,"Kasparas","Gustas","Kaunas",{"$nulls":9},"O",null,null,"X","X","X",{"$nulls":15},{"v":4.8,"d":"4.80"},{"$f":"IF(ISBLANK(AI8),\"\",IF(AI8>=4.6,\"KSM\",IF(AI8>=4.1,\"I A\",IF(AI8>=3.5,\"II A\",IF(AI8>=3.05,\"III A\",IF(AI8>=2.6,\"I JA\",IF(AI8>=2.2,\"II JA\",IF(AI8>=1.9,\"III JA\"))))))))","v":"KSM"}]
[null,"2007-08-02","R.Sadzevičienė","Startas"]
[2,"Juozas","Žaliūkas","Šiauliai","O",null,null,"O",null,null,"X","X","X",{"$nulls":21},{"v":3,"d":"3.00"},{"$f":"IF(ISBLANK(AI10),\"\",IF(AI10>=4.6,\"KSM\",IF(AI10>=4.1,\"I A\",IF(AI10>=3.5,\"II A\",IF(AI10>=3.05,\"III A\",IF(AI10>=2.6,\"I JA\",IF(AI10>=2.2,\"II JA\",IF(AI10>=1.9,\"III JA\"))))))))","v":"I JA"}]
[null,"2009-07-28","D. Vrubliauskas","ŠLASC"]